{"text_format":"1","workbook":"xlsx","n_sheets":24,"sheets":["北区","都島区","福島区","此花区","中央区","西区","港区","大正区","天王寺区","浪速区","西淀川区","淀川区","東淀川区","東成区","生野区","旭区","城東区","鶴見区","阿倍野区","住之江区","住吉区","東住吉区","平野区","西成区"],"not_rendered":{"charts":0,"images":0,"macros":1,"external_links":48,"defined_names":348,"comments":0,"pivot_tables":0},"unopened":[],"bounds":{"document_bytes":16777216,"sheet_cells":100000,"rows_first":2000,"rows_last":500,"rows_between":2000,"halvings":0,"cell_chars":16384,"cell_head_chars":4096},"cells_cut":0,"cells_raw":0,"read":"whole","date_system":"1900"}

{"sheet":"北区","index":0,"n_rows":22,"n_cols":5,"rows_kept":22,"cut":false,"hidden":false,"merged":[[18,0,19,0],[18,2,19,2],[18,3,19,3],[18,4,19,4],[6,0,7,0],[6,2,7,2],[6,3,7,3],[6,4,7,4],[12,0,13,0],[12,2,13,2],[12,3,13,3],[12,4,13,4],[14,0,15,0],[14,2,15,2],[14,3,15,3],[14,4,15,4],[16,0,17,0],[16,2,17,2],[16,3,17,3],[16,4,17,4],[10,0,11,0],[10,2,11,2],[10,3,11,3],[10,4,11,4],[8,0,9,0],[8,2,9,2],[8,3,9,3],[8,4,9,4],[1,0,1,2],[4,0,5,0],[4,2,5,2],[4,3,5,3],[4,4,5,4]]}
[]
["大阪市北区",null,null,"選挙区",{"$f":"\"　　定数　\"&VLOOKUP(北区!A2,'[1]選挙区・定数（削除禁止）'!B2:C54,2,FALSE)","v":"　　定数　4"}]
[]
[]
["届出\n番号","ふりがな","党派","現元新の別","一のウェブサイト等のアドレス"]
[null,"候補者氏名"]
[1,"こんどう　だい","大阪維新の会","新","https://go2senkyo.com/seijika/187721"]
[null,"近藤　大"]
[2,"やまもと　　　　こ","公明党","現","http://www.tomoko-yamamoto.jp"]
[null,"山本　とも子"]
[3,null,"無所属","新","http://www.atsumi-k1.com"]
[null,"あつみ　かつや"]
[4,"　　　　　　たかゆき","大阪維新の会","現","http://oneosaka.jp/member/detail/kuramoto_takayuki.html"]
[null,"くらもと　隆之"]
[5,"まえだ　　　　　　　","自由民主党","現","https://kazuhiko-maeda.weblike.jp"]
[null,"前田　かずひこ"]
[6,null,"無所属","元","http://niizato-y.net"]
[null,"にいざと　よしたか"]
[7,"たかやま　　　　","大阪維新の会","現","http://takayamamika.com"]
[null,"高山　みか"]
[]
["注）候補者氏名欄には、通称を使用する場合は通称を記載。"]

{"sheet":"都島区","index":1,"n_rows":16,"n_cols":5,"rows_kept":16,"cut":false,"hidden":false,"merged":[[6,0,7,0],[6,2,7,2],[6,3,7,3],[6,4,7,4],[8,0,9,0],[8,2,9,2],[8,3,9,3],[8,4,9,4],[12,0,13,0],[12,2,13,2],[12,3,13,3],[12,4,13,4],[10,0,11,0],[10,2,11,2],[10,3,11,3],[10,4,11,4],[1,0,1,2],[4,0,5,0],[4,2,5,2],[4,3,5,3],[4,4,5,4]]}
[]
["大阪市都島区",null,null,"選挙区",{"$f":"\"　　定数　\"&VLOOKUP(都島区!A2,'[3]選挙区・定数（削除禁止）'!B2:C24,2,FALSE)","v":"　　定数　3"}]
[]
[]
["届出\n番号","ふりがな","党派","現元新の別","一のウェブサイト等のアドレス"]
[null,"候補者氏名"]
[1," 　 　　　　きよみ","公明党","新","https://go2senkyo.com/seijika/186617 "]
[null,"ささき　清美"]
[2," 　 おおにし　　　　　　　　","大阪維新の会","現","https://go2senkyo.com/seijika/170075 "]
[null,"大西　しょういち"]
[3," 　 おかだ　　　　　　　　","大阪維新の会","現","http://okada-yasutomo.com "]
[null,"岡田　やすとも"]
[4," 　 あらき　　　　　　　","自由民主党","元","https://araki-hajime.net "]
[null,"荒木　はじめ"]
[]
["注）候補者氏名欄には、通称を使用する場合は通称を記載。"]

{"sheet":"福島区","index":2,"n_rows":16,"n_cols":5,"rows_kept":16,"cut":false,"hidden":false,"merged":[[6,0,7,0],[6,2,7,2],[6,3,7,3],[6,4,7,4],[12,0,13,0],[12,2,13,2],[12,3,13,3],[12,4,13,4],[8,0,9,0],[8,2,9,2],[8,3,9,3],[8,4,9,4],[10,0,11,0],[10,2,11,2],[10,3,11,3],[10,4,11,4],[1,0,1,2],[4,0,5,0],[4,2,5,2],[4,3,5,3],[4,4,5,4]]}
[]
["大阪市福島区",null,null,"選挙区",{"$f":"\"　　定数　\"&VLOOKUP(福島区!A2,'[5]選挙区・定数（削除禁止）'!B2:C24,2,FALSE)","v":"　　定数　2"}]
[]
[]
["届出\n番号","ふりがな","党派","現元新の別","一のウェブサイト等のアドレス"]
[null,"候補者氏名"]
[1," 　 ひろた　　　　　　　","大阪維新の会","現","http://hirotano.com "]
[null,"広田　かずみ"]
[2,"おおた　かつき","自由民主党","新","https://ootakatsuki.wixsite.com/my-site "]
[null,"太田　勝己"]
[3," 　 さか　　　　　　　","無所属","新","https://linktr.ee/saka_koki "]
[null,"坂　こうき"]
[4,"やまだ　　　　　","日本共産党","新","https://www.facebook.com/fukuminori "]
[null,"山田　みのり"]
[]
["注）候補者氏名欄には、通称を使用する場合は通称を記載。"]

{"sheet":"此花区","index":3,"n_rows":14,"n_cols":5,"rows_kept":14,"cut":false,"hidden":false,"merged":[[6,0,7,0],[6,2,7,2],[6,3,7,3],[6,4,7,4],[1,0,1,2],[4,0,5,0],[4,2,5,2],[4,3,5,3],[4,4,5,4],[8,0,9,0],[8,2,9,2],[8,3,9,3],[8,4,9,4],[10,0,11,0],[10,2,11,2],[10,3,11,3],[10,4,11,4]]}
[]
["大阪市此花区",null,null,"選挙区",{"$f":"\"　　定数　\"&VLOOKUP(此花区!A2,'[7]選挙区・定数（削除禁止）'!B2:C24,2,FALSE)","v":"　　定数　2"}]
[]
[]
["届出\n番号","ふりがな","党派","現元新の別","一のウェブサイト等のアドレス"]
[null,"候補者氏名"]
[1," 　 いまだ　　　　　　　","公明党","現","https://www.komei.or.jp/km/nobuyuki-imada-osaka/ "]
[null,"今田　のぶゆき"]
[2," 　 　　　　ひろゆき","大阪維新の会","新","https://takechi-hiroyuki.jp "]
[null,"たけち　博幸"]
[3," 　 　　　かずまさ","日本共産党","元","http://jcp-nishikono.net/85-2 "]
[null,"せと　一正"]
[]
["注）候補者氏名欄には、通称を使用する場合は通称を記載。"]

{"sheet":"中央区","index":4,"n_rows":18,"n_cols":5,"rows_kept":18,"cut":false,"hidden":false,"merged":[[14,0,15,0],[14,2,15,2],[14,3,15,3],[14,4,15,4],[12,0,13,0],[12,2,13,2],[12,3,13,3],[12,4,13,4],[6,0,7,0],[6,2,7,2],[6,3,7,3],[6,4,7,4],[10,0,11,0],[10,2,11,2],[10,3,11,3],[10,4,11,4],[8,0,9,0],[8,2,9,2],[8,3,9,3],[8,4,9,4],[1,0,1,2],[4,0,5,0],[4,2,5,2],[4,3,5,3],[4,4,5,4]]}
[]
["大阪市中央区",null,null,"選挙区",{"$f":"\"　　定数　\"&VLOOKUP(中央区!A2,'[9]選挙区・定数（削除禁止）'!B2:C24,2,FALSE)","v":"　　定数　3"}]
[]
[]
["届出\n番号","ふりがな","党派","現元新の別","一のウェブサイト等のアドレス"]
[null,"候補者氏名"]
[1," 　 　　　　こうぞう","無所属","元","http://www.kk-ap.co.jp/gonse/ "]
[null,"ごんせ　幸蔵"]
[2," 　 すずき　　　　　","自由民主党","新"," "]
[null,"鈴木　りえ"]
[3," 　 しおなか　　　　　　　　","大阪維新の会","現","https://twitter.com/shionaka_ishin "]
[null,"塩中　かずしげ"]
[4," 　 まつさか　　　　　　　","無所属","新","https://matsusakaisao.net/ "]
[null,"松阪　いさお"]
[5," 　 のがみ　　　　　","大阪維新の会","現","https://rannogami.theblog.me "]
[null,"野上　らん"]
[]
["注）候補者氏名欄には、通称を使用する場合は通称を記載。"]

{"sheet":"西区","index":5,"n_rows":18,"n_cols":5,"rows_kept":18,"cut":false,"hidden":false,"merged":[[1,0,1,2],[4,0,5,0],[4,2,5,2],[4,3,5,3],[4,4,5,4],[14,0,15,0],[14,2,15,2],[14,3,15,3],[14,4,15,4],[8,0,9,0],[8,2,9,2],[8,3,9,3],[8,4,9,4],[6,2,7,2],[6,3,7,3],[6,4,7,4],[12,0,13,0],[12,2,13,2],[12,3,13,3],[12,4,13,4],[10,0,11,0],[10,2,11,2],[10,3,11,3],[10,4,11,4],[6,0,7,0]]}
[]
["大阪市西区",null,null,"選挙区",{"$f":"\"　　定数　\"&VLOOKUP(西区!A2,'[11]選挙区・定数（削除禁止）'!B2:C24,2,FALSE)","v":"　　定数　3"}]
[]
[]
["届出\n番号","ふりがな","党派","現元新の別","一のウェブサイト等のアドレス"]
[null,"候補者氏名"]
[1,"ふるや　よしひこ","無所属","新"," "]
[null,"古谷　仁彦"]
[2," 　 ながい　　　　　　　","自由民主党","現","https://www.facebook.com/keisuke.nagai56 "]
[null,"永井　けいすけ"]
[3," 　 ひらまつ　　　　　　","無所属","新","https://youtu.be/u782ITVoxa8 "]
[null,"平松　ひでき"]
[4," 　 ひがし　　　　　　　","大阪維新の会","現","http://www.nishikarahigashi.com/ "]
[null,"東　たかゆき"]
[5," 　 にし　　　　　　　　","大阪維新の会","現"," "]
[null,"西　たくろう"]
[]
["注）候補者氏名欄には、通称を使用する場合は通称を記載。"]

{"sheet":"港区","index":6,"n_rows":16,"n_cols":5,"rows_kept":16,"cut":false,"hidden":false,"merged":[[1,0,1,2],[4,0,5,0],[4,2,5,2],[4,3,5,3],[4,4,5,4],[12,0,13,0],[12,2,13,2],[12,3,13,3],[12,4,13,4],[10,0,11,0],[10,2,11,2],[10,3,11,3],[10,4,11,4],[6,2,7,2],[6,3,7,3],[6,4,7,4],[8,0,9,0],[8,2,9,2],[8,3,9,3],[8,4,9,4],[6,0,7,0]]}
[]
["大阪市港区",null,null,"選挙区",{"$f":"\"　　定数　\"&VLOOKUP(港区!A2,'[13]選挙区・定数（削除禁止）'!B2:C24,2,FALSE)","v":"　　定数　2"}]
[]
[]
["届出\n番号","ふりがな","党派","現元新の別","一のウェブサイト等のアドレス"]
[null,"候補者氏名"]
[1,"にし　　　　　","公明党","現","norihito-nishi.com "]
[null,"西　のりひと"]
[2,"たけうち　　　　　","日本共産党","新","https://twitter.com/takeuchi_jcp "]
[null,"竹内　よしのり"]
[3,"ふじた　　　　　","大阪維新の会","現","https://fujitaakira.com/ "]
[null,"藤田　あきら"]
[4,"ひらはら　　　　","大阪維新の会","新"," "]
[null,"平原　こうや"]
[]
["注）候補者氏名欄には、通称を使用する場合は通称を記載。"]

{"sheet":"大正区","index":7,"n_rows":14,"n_cols":5,"rows_kept":14,"cut":false,"hidden":false,"merged":[[1,0,1,2],[4,0,5,0],[4,2,5,2],[4,3,5,3],[4,4,5,4],[6,0,7,0],[6,2,7,2],[6,3,7,3],[6,4,7,4],[10,0,11,0],[10,2,11,2],[10,3,11,3],[10,4,11,4],[8,0,9,0],[8,2,9,2],[8,3,9,3],[8,4,9,4]]}
[]
["大阪市大正区",null,null,"選挙区",{"$f":"\"　　定数　\"&VLOOKUP(大正区!A2,'[15]選挙区・定数（削除禁止）'!B2:C24,2,FALSE)","v":"　　定数　2"}]
[]
[]
["届出\n番号","ふりがな","党派","現元新の別","一のウェブサイト等のアドレス"]
[null,"候補者氏名"]
[1," 　 こやま　　　　　　　","公明党","現","https://www.koyama-mituaki.com "]
[null,"小山　みつあき"]
[2," 　 いずも　　　　　　　","大阪維新の会","現"," "]
[null,"出雲　てるひで"]
[3," 　 　　　　たかし","日本共産党","元"," "]
[null,"こはら　孝志"]
[]
["注）候補者氏名欄には、通称を使用する場合は通称を記載。"]

{"sheet":"天王寺区","index":8,"n_rows":14,"n_cols":5,"rows_kept":14,"cut":false,"hidden":false,"merged":[[1,0,1,2],[4,0,5,0],[4,2,5,2],[4,3,5,3],[4,4,5,4],[6,0,7,0],[6,2,7,2],[6,3,7,3],[6,4,7,4],[10,0,11,0],[10,2,11,2],[10,3,11,3],[10,4,11,4],[8,0,9,0],[8,2,9,2],[8,3,9,3],[8,4,9,4]]}
[]
["大阪市天王寺区",null,null,"選挙区",{"$f":"\"　　定数　\"&VLOOKUP(天王寺区!A2,'[17]選挙区・定数（削除禁止）'!B2:C24,2,FALSE)","v":"　　定数　2"}]
[]
[]
["届出\n番号","ふりがな","党派","現元新の別","一のウェブサイト等のアドレス"]
[null,"候補者氏名"]
[1," 　 ひとみ　　　　　　","大阪維新の会","新","https://twitter.com/HitomiTsuy12646 "]
[null,"人見　つよし"]
[2," 　 すどう　　　　　　　　","自由民主党","新","https://sspo.jp "]
[null,"須藤　しょうた"]
[3," 　 かねこ　　　　　","大阪維新の会","現","https://ishin-kaneko.com/ "]
[null,"金子　エミ"]
[]
["注）候補者氏名欄には、通称を使用する場合は通称を記載。"]

{"sheet":"浪速区","index":9,"n_rows":14,"n_cols":5,"rows_kept":14,"cut":false,"hidden":false,"merged":[[6,0,7,0],[6,2,7,2],[6,3,7,3],[6,4,7,4],[1,0,1,2],[4,0,5,0],[4,2,5,2],[4,3,5,3],[4,4,5,4],[10,0,11,0],[10,2,11,2],[10,3,11,3],[10,4,11,4],[8,0,9,0],[8,2,9,2],[8,3,9,3],[8,4,9,4]]}
[]
["大阪市浪速区",null,null,"選挙区",{"$f":"\"　　定数　\"&VLOOKUP(浪速区!A2,'[19]選挙区・定数（削除禁止）'!B2:C24,2,FALSE)","v":"　　定数　2"}]
[]
[]
["届出\n番号","ふりがな","党派","現元新の別","一のウェブサイト等のアドレス"]
[null,"候補者氏名"]
[1," 　 たけした　　　　　　","大阪維新の会","現","https://twitter.com/takeshitatakash?lang=ja "]
[null,"竹下　たかし"]
[2," 　 まるやま　　　　　　","日本共産党","新"," "]
[null,"円山　なおこ"]
[3," 　 もりやま　　　　　　　","無所属","現","http://moriyama728.com/ "]
[null,"森山　よしひさ"]
[]
["注）候補者氏名欄には、通称を使用する場合は通称を記載。"]

{"sheet":"西淀川区","index":10,"n_rows":18,"n_cols":5,"rows_kept":18,"cut":false,"hidden":false,"merged":[[6,0,7,0],[6,2,7,2],[6,3,7,3],[6,4,7,4],[1,0,1,2],[4,0,5,0],[4,2,5,2],[4,3,5,3],[4,4,5,4],[8,0,9,0],[8,2,9,2],[8,3,9,3],[8,4,9,4],[14,0,15,0],[14,2,15,2],[14,3,15,3],[14,4,15,4],[12,0,13,0],[12,2,13,2],[12,3,13,3],[12,4,13,4],[10,0,11,0],[10,2,11,2],[10,3,11,3],[10,4,11,4]]}
[]
["大阪市西淀川区",null,null,"選挙区",{"$f":"\"　　定数　\"&VLOOKUP(西淀川区!A2,'[21]選挙区・定数（削除禁止）'!B2:C24,2,FALSE)","v":"　　定数　3"}]
[]
[]
["届出\n番号","ふりがな","党派","現元新の別","一のウェブサイト等のアドレス"]
[null,"候補者氏名"]
[1,"あらき　みきお","自由民主党","現"," "]
[null,"荒木　幹男"]
[2," 　 やまだ　　　　　　","大阪維新の会","現","https://yamadahajime.com "]
[null,"山田　はじめ"]
[3,"きたやま　りょうぞう","日本共産党","元","http://jcp-nishikono.net "]
[null,"北山　良三"]
[4," 　 　　　　てつお","公明党","現","http://www.komei.or.jp/km/sasaki-tetsuo21/ "]
[null,"ささき　哲夫"]
[5," 　 やまだ　　　　　　","大阪維新の会","新"," "]
[null,"山田　かな"]
[]
["注）候補者氏名欄には、通称を使用する場合は通称を記載。"]

{"sheet":"淀川区","index":11,"n_rows":20,"n_cols":5,"rows_kept":20,"cut":false,"hidden":false,"merged":[[1,0,1,2],[4,0,5,0],[4,2,5,2],[4,3,5,3],[4,4,5,4],[10,2,11,2],[10,3,11,3],[10,4,11,4],[16,0,17,0],[16,2,17,2],[16,3,17,3],[16,4,17,4],[10,0,11,0],[14,0,15,0],[14,2,15,2],[14,3,15,3],[14,4,15,4],[12,0,13,0],[12,2,13,2],[12,3,13,3],[12,4,13,4],[6,0,7,0],[6,2,7,2],[6,3,7,3],[6,4,7,4],[8,0,9,0],[8,2,9,2],[8,3,9,3],[8,4,9,4]]}
[]
["大阪市淀川区",null,null,"選挙区",{"$f":"\"　　定数　\"&VLOOKUP(淀川区!A2,'[23]選挙区・定数（削除禁止）'!B2:C24,2,FALSE)","v":"　　定数　5"}]
[]
[]
["届出\n番号","ふりがな","党派","現元新の別","一のウェブサイト等のアドレス"]
[null,"候補者氏名"]
[1,"　　　　　りゅうすけ","日本共産党","新"," "]
[null,"みなと　隆介"]
[2," 　 さたけ　　　　　","大阪維新の会","新","http://satakeriho.info "]
[null,"佐竹　りほ"]
[3," 　 すぎた　　　 　　　　","公明党","現","http://www.sugita-t.net "]
[null,"杉田　ただひろ"]
[4," 　 いまむら　　　　　","大阪維新の会","新"," "]
[null,"今村　なおと"]
[5," 　 みなみ　　　　　　　　","自由民主党","新","https://minami-takafumi.info/ "]
[null,"南　たかふみ"]
[6," 　 さかい　　　　　　　","大阪維新の会","現","https://sakai-hajime.com "]
[null,"坂井　はじめ"]
[]
["注）候補者氏名欄には、通称を使用する場合は通称を記載。"]

{"sheet":"東淀川区","index":12,"n_rows":24,"n_cols":5,"rows_kept":24,"cut":false,"hidden":false,"merged":[[20,0,21,0],[20,2,21,2],[20,3,21,3],[20,4,21,4],[12,0,13,0],[12,2,13,2],[12,3,13,3],[12,4,13,4],[14,0,15,0],[14,2,15,2],[14,3,15,3],[14,4,15,4],[18,0,19,0],[18,2,19,2],[18,3,19,3],[18,4,19,4],[6,0,7,0],[6,2,7,2],[6,3,7,3],[6,4,7,4],[16,0,17,0],[16,2,17,2],[16,3,17,3],[16,4,17,4],[10,0,11,0],[10,2,11,2],[10,3,11,3],[10,4,11,4],[8,0,9,0],[8,2,9,2],[8,3,9,3],[8,4,9,4],[1,0,1,2],[4,0,5,0],[4,2,5,2],[4,3,5,3],[4,4,5,4]]}
[]
["大阪市東淀川区",null,null,"選挙区",{"$f":"\"　　定数　\"&VLOOKUP(東淀川区!A2,'[25]選挙区・定数（削除禁止）'!B2:C24,2,FALSE)","v":"　　定数　5"}]
[]
[]
["届出\n番号","ふりがな","党派","現元新の別","一のウェブサイト等のアドレス"]
[null,"候補者氏名"]
[1,"いしかわ　ひろき","自由民主党","現","https://hiroki.ishikawa.jp/ "]
[null,"石川　博紀"]
[2," 　 　　　　　　　","無所属","新","https://katsuda-hideki.jp/ "]
[null,"かつだ　ひでき"]
[3," 　 　　　　　たかふみ","無所属","新","https://www.omonishi.com "]
[null,"おもにし　貴文"]
[4," 　 もり　　　　　　　","公明党","新"," "]
[null,"森　けいご"]
[5,"ながおか　　　　","日本共産党","現","http://yuricolumn.osaka.jp/ "]
[null,"長岡　ゆりこ"]
[6," 　 いわいけ　　　　　","大阪維新の会","新","https://i-kiyo.com "]
[null,"岩池　きよ"]
[7," 　 はしもと　　　　　　","大阪維新の会","現","https://hashimotomasato.com "]
[null,"橋本　まさと"]
[8," 　 　　　　　　　　","大阪維新の会","新","https://mobile.twitter.com〉masumoto_saori〉status "]
[null,"ますもと　さおり"]
[]
["注）候補者氏名欄には、通称を使用する場合は通称を記載。"]

{"sheet":"東成区","index":13,"n_rows":20,"n_cols":5,"rows_kept":20,"cut":false,"hidden":false,"merged":[[1,0,1,2],[4,0,5,0],[4,2,5,2],[4,3,5,3],[4,4,5,4],[10,2,11,2],[10,3,11,3],[10,4,11,4],[14,0,15,0],[14,2,15,2],[14,3,15,3],[14,4,15,4],[10,0,11,0],[16,0,17,0],[16,2,17,2],[16,3,17,3],[16,4,17,4],[6,0,7,0],[6,2,7,2],[6,3,7,3],[6,4,7,4],[8,0,9,0],[8,2,9,2],[8,3,9,3],[8,4,9,4],[12,0,13,0],[12,2,13,2],[12,3,13,3],[12,4,13,4]]}
[]
["大阪市東成区",null,null,"選挙区",{"$f":"\"　　定数　\"&VLOOKUP(東成区!A2,'[27]選挙区・定数（削除禁止）'!B2:C24,2,FALSE)","v":"　　定数　3"}]
[]
[]
["届出\n番号","ふりがな","党派","現元新の別","一のウェブサイト等のアドレス"]
[null,"候補者氏名"]
[1,"　　　　　たかし","公明党","新","https://www.komei.or.jp/km/oosaka-tsukasa-takashi/ "]
[null,"つかさ　隆史"]
[2,"おかざき　　　　","大阪維新の会","現","http://futoshi-ishin.com "]
[null,"岡崎　ふとし"]
[3,null,"自由民主党","現","https://h-kawashima.com "]
[null,"かわしま　ひろとし"]
[4,"こんどう　　　","大阪維新の会","新"," "]
[null,"近藤　みわ"]
[5,"のいり　としつぐ","れいわ新選組","新"," "]
[null,"野入　俊二"]
[6,"ふじわら　　　　　","無所属","新","http://instagram.com/kosmoschallenge "]
[null,"藤原　よういち"]
[]
["注）候補者氏名欄には、通称を使用する場合は通称を記載。"]

{"sheet":"生野区","index":14,"n_rows":20,"n_cols":5,"rows_kept":20,"cut":false,"hidden":false,"merged":[[10,0,11,0],[10,2,11,2],[10,3,11,3],[10,4,11,4],[12,0,13,0],[12,2,13,2],[12,3,13,3],[12,4,13,4],[8,0,9,0],[8,2,9,2],[8,3,9,3],[8,4,9,4],[6,0,7,0],[6,2,7,2],[6,3,7,3],[6,4,7,4],[14,0,15,0],[14,2,15,2],[14,3,15,3],[14,4,15,4],[16,0,17,0],[16,2,17,2],[16,3,17,3],[16,4,17,4],[1,0,1,2],[4,0,5,0],[4,2,5,2],[4,3,5,3],[4,4,5,4]]}
[]
["大阪市生野区",null,null,"選挙区",{"$f":"\"　　定数　\"&VLOOKUP(生野区!A2,'[29]選挙区・定数（削除禁止）'!B2:C24,2,FALSE)","v":"　　定数　4"}]
[]
[]
["届出\n番号","ふりがな","党派","現元新の別","一のウェブサイト等のアドレス"]
[null,"候補者氏名"]
[1," 　 やまだ　　　　　　　","公明党","現","http://www.yamada-masakazu.com "]
[null,"山田　まさかず"]
[2," 　 たけ　　　　　　","無所属","現","https://www.take-naoki.com "]
[null,"武　なおき"]
[3," 　 くろだ　　　　　　","自由民主党","元","https://黒田まさし.com "]
[null,"黒田　まさし"]
[4,"きのした　まこと","大阪維新の会","現"]
[null,"木下　誠"]
[5," 　 にしだ　　　こ　　","日本共産党","新","http://nishidasaeco.net/ "]
[null,"西田　さえ子"]
[6," 　 はらぐち　　　　　　","大阪維新の会","現","https://haraguchi-yusuke.com/ "]
[null,"原口　ゆうすけ"]
[]
["注）候補者氏名欄には、通称を使用する場合は通称を記載。"]

{"sheet":"旭区","index":15,"n_rows":18,"n_cols":5,"rows_kept":18,"cut":false,"hidden":false,"merged":[[1,0,1,2],[4,0,5,0],[4,2,5,2],[4,3,5,3],[4,4,5,4],[10,0,11,0],[10,2,11,2],[10,3,11,3],[10,4,11,4],[14,0,15,0],[14,2,15,2],[14,3,15,3],[14,4,15,4],[12,0,13,0],[12,2,13,2],[12,3,13,3],[12,4,13,4],[6,2,7,2],[6,3,7,3],[6,4,7,4],[8,0,9,0],[8,2,9,2],[8,3,9,3],[8,4,9,4],[6,0,7,0]]}
[]
["大阪市旭区",null,null,"選挙区",{"$f":"\"　　定数　\"&VLOOKUP(旭区!A2,'[31]選挙区・定数（削除禁止）'!B2:C24,2,FALSE)","v":"　　定数　3"}]
[]
[]
["届出\n番号","ふりがな","党派","現元新の別","一のウェブサイト等のアドレス"]
[null,"候補者氏名"]
[1," 　 　　　　こういち","日本共産党","元","http://park1.wakwak.com/~momi/watasiHP/ "]
[null,"わたし　考一"]
[2," 　 みやわき　　　　　　","大阪維新の会","現","https://infonozomim.wixsite.com/nozomi-ishin "]
[null,"宮脇　のぞみ"]
[3,"やまもと　はじめ","大阪維新の会","新","https://www.facebook.com/hajime.yamamoto1 "]
[null,"山本　大"]
[4," 　 にしざき　　　　　　　","公明党","現","https://www.komei.or.jp/km/osakacity-nishizaki-teruaki/ "]
[null,"西﨑　てるあき"]
[5,"ふくだ　たけひろ","無所属","現","https://fukuda-takehiro.jp/ "]
[null,"福田　武洋"]
[]
["注）候補者氏名欄には、通称を使用する場合は通称を記載。"]

{"sheet":"城東区","index":16,"n_rows":20,"n_cols":5,"rows_kept":20,"cut":false,"hidden":false,"merged":[[4,4,5,4],[6,0,7,0],[1,0,1,2],[4,0,5,0],[4,2,5,2],[4,3,5,3],[10,2,11,2],[10,3,11,3],[10,4,11,4],[8,0,9,0],[8,2,9,2],[8,3,9,3],[8,4,9,4],[16,0,17,0],[16,2,17,2],[16,3,17,3],[16,4,17,4],[6,2,7,2],[6,3,7,3],[6,4,7,4],[12,0,13,0],[12,2,13,2],[12,3,13,3],[12,4,13,4],[14,0,15,0],[14,2,15,2],[14,3,15,3],[14,4,15,4],[10,0,11,0]]}
[]
["大阪市城東区",null,null,"選挙区",{"$f":"\"　　定数　\"&VLOOKUP(城東区!A2,'[33]選挙区・定数（削除禁止）'!B2:C24,2,FALSE)","v":"　　定数　5"}]
[]
[]
["届出\n番号","ふりがな","党派","現元新の別","一のウェブサイト等のアドレス"]
[null,"候補者氏名"]
[1,"やまなか　ともこ","日本共産党","現","http://yamanaka-tomoko.wajcp.net/ "]
[null,"山中　智子"]
[2," 　 あかし　　　　　　","公明党","現","http://www.akashi-naoki.net "]
[null,"明石　なおき"]
[3," 　 にしかわ　　　　　","自由民主党","現","http://nishikawa-hiroji.jp/ "]
[null,"西川　ひろじ"]
[4," 　 　　　　　　","大阪維新の会","現","http://honda-ishin.com "]
[null,"ホンダ　リエ"]
[5," 　 ばば　　　　　　　　　","大阪維新の会","新","https://baba-noriyuki.com/ "]
[null,"馬場　　のりゆき"]
[6," 　 　　　　しんいち","大阪維新の会","現","http://shinichi-washimi.jp/ "]
[null,"わしみ　慎一"]
[]
["注）候補者氏名欄には、通称を使用する場合は通称を記載。"]

{"sheet":"鶴見区","index":17,"n_rows":16,"n_cols":5,"rows_kept":16,"cut":false,"hidden":false,"merged":[[12,0,13,0],[12,2,13,2],[12,3,13,3],[12,4,13,4],[10,0,11,0],[10,2,11,2],[10,3,11,3],[10,4,11,4],[6,0,7,0],[6,2,7,2],[6,3,7,3],[6,4,7,4],[8,0,9,0],[8,2,9,2],[8,3,9,3],[8,4,9,4],[1,0,1,2],[4,0,5,0],[4,2,5,2],[4,3,5,3],[4,4,5,4]]}
[]
["大阪市鶴見区",null,null,"選挙区",{"$f":"\"　　定数　\"&VLOOKUP(鶴見区!A2,'[35]選挙区・定数（削除禁止）'!B2:C24,2,FALSE)","v":"　　定数　3"}]
[]
[]
["届出\n番号","ふりがな","党派","現元新の別","一のウェブサイト等のアドレス"]
[null,"候補者氏名"]
[1," 　 おおはし　　　　　　　","大阪維新の会","現","http://www.ohashikazutaka.jp/ "]
[null,"大橋　かずたか"]
[2," 　 　　　やすお","公明党","現","https://www.komei.or.jp/km/osakacity-toki-yasuo/ "]
[null,"トキ　恭生"]
[3," 　 ひらやま　　　　　　　　","自由民主党","新","https://hirayamaryudo.com "]
[null,"平山　りゅうどう"]
[4," 　 くろだ　　　　　　","大阪維新の会","現","https://twitter.com/marico_kuroda "]
[null,"黒田　まりこ"]
[]
["注）候補者氏名欄には、通称を使用する場合は通称を記載。"]

{"sheet":"阿倍野区","index":18,"n_rows":18,"n_cols":5,"rows_kept":18,"cut":false,"hidden":false,"merged":[[14,0,15,0],[14,2,15,2],[14,3,15,3],[14,4,15,4],[12,0,13,0],[12,2,13,2],[12,3,13,3],[12,4,13,4],[6,0,7,0],[6,2,7,2],[6,3,7,3],[6,4,7,4],[10,0,11,0],[10,2,11,2],[10,3,11,3],[10,4,11,4],[8,0,9,0],[8,2,9,2],[8,3,9,3],[8,4,9,4],[1,0,1,2],[4,0,5,0],[4,2,5,2],[4,3,5,3],[4,4,5,4]]}
[]
["大阪市阿倍野区",null,null,"選挙区",{"$f":"\"　　定数　\"&VLOOKUP(阿倍野区!A2,'[37]選挙区・定数（削除禁止）'!B2:C24,2,FALSE)","v":"　　定数　3"}]
[]
[]
["届出\n番号","ふりがな","党派","現元新の別","一のウェブサイト等のアドレス"]
[null,"候補者氏名"]
[1,"　　　　　　まこと","大阪維新の会","現","http://www.umezono-makoto.com "]
[null,"うめぞの　周"]
[2,"きのした　　　　　","自由民主党","現","https://www.kinoshita-yoshinobu.com "]
[null,"木下　よしのぶ"]
[3,"　　　　　けんご","れいわ新選組","新","https://twitter.com/kosenlf888 "]
[null,"かばた　健吾"]
[4,"たにい　　　　　","大阪維新の会","新","https://twitter.com/tanii_osaka "]
[null,"谷井　まさよし"]
[5,"たなか　　　　　","無所属","新","https://tanakazu-abeno.com "]
[null,"田中　かずのり"]
[]
["注）候補者氏名欄には、通称を使用する場合は通称を記載。"]

{"sheet":"住之江区","index":19,"n_rows":22,"n_cols":5,"rows_kept":22,"cut":false,"hidden":false,"merged":[[1,0,1,2],[4,0,5,0],[4,2,5,2],[4,3,5,3],[4,4,5,4],[12,0,13,0],[12,2,13,2],[12,3,13,3],[12,4,13,4],[16,0,17,0],[16,2,17,2],[16,3,17,3],[16,4,17,4],[18,0,19,0],[18,2,19,2],[18,3,19,3],[18,4,19,4],[14,0,15,0],[14,2,15,2],[14,3,15,3],[14,4,15,4],[10,0,11,0],[10,2,11,2],[10,3,11,3],[10,4,11,4],[6,2,7,2],[6,3,7,3],[6,4,7,4],[8,0,9,0],[8,2,9,2],[8,3,9,3],[8,4,9,4],[6,0,7,0]]}
[]
["大阪市住之江区",null,null,"選挙区",{"$f":"\"　　定数　\"&VLOOKUP(住之江区!A2,'[39]選挙区・定数（削除禁止）'!B2:C24,2,FALSE)","v":"　　定数　4"}]
[]
[]
["届出\n番号","ふりがな","党派","現元新の別","一のウェブサイト等のアドレス"]
[null,"候補者氏名"]
[1," 　 　　　　だいすけ","日本共産党","新","https://kidugawaminami.wajcp.net/member_news#tsujii_daisuke "]
[null,"つじい　大介"]
[2," 　 　　　　ともみ","自由民主党","新","https://isshi.org "]
[null,"いっし　智美"]
[3," 　 まつざき　　　　　　","無所属","現","http://www.matsuzaki-toru.com/ "]
[null,"松崎　とおる"]
[4,"きしもと　さかえ","公明党","現","http://www.komei.or.jp/km/osaka-kishimoto-sakae "]
[null,"岸本　栄"]
[5," 　 ささき　　　　　","大阪維新の会","現","http://www.sasaki-rie.jp "]
[null,"佐々木　りえ"]
[6,"かたやま　いっぽ","大阪維新の会","現","http://katayama-ippo.com/ "]
[null,"片山　一歩"]
[7,"たなか　こうたろう","無所属","新"," "]
[null,"田中　耕太郎"]
[]
["注）候補者氏名欄には、通称を使用する場合は通称を記載。"]

{"sheet":"住吉区","index":20,"n_rows":24,"n_cols":5,"rows_kept":24,"cut":false,"hidden":false,"merged":[[1,0,1,2],[4,0,5,0],[4,2,5,2],[4,3,5,3],[4,4,5,4],[6,0,7,0],[6,2,7,2],[6,3,7,3],[6,4,7,4],[12,2,13,2],[12,3,13,3],[12,4,13,4],[12,0,13,0],[8,0,9,0],[8,2,9,2],[8,3,9,3],[8,4,9,4],[10,0,11,0],[10,2,11,2],[10,3,11,3],[10,4,11,4],[16,0,17,0],[16,2,17,2],[16,3,17,3],[16,4,17,4],[14,0,15,0],[14,2,15,2],[14,3,15,3],[14,4,15,4],[20,0,21,0],[20,2,21,2],[20,3,21,3],[20,4,21,4],[18,0,19,0],[18,2,19,2],[18,3,19,3],[18,4,19,4]]}
[]
["大阪市住吉区",null,null,"選挙区",{"$f":"\"　　定数　\"&VLOOKUP(住吉区!A2,'[41]選挙区・定数（削除禁止）'!B2:C24,2,FALSE)","v":"　　定数　5"}]
[]
[]
["届出\n番号","ふりがな","党派","現元新の別","一のウェブサイト等のアドレス"]
[null,"候補者氏名"]
[1," 　 うえだ　　　　　　　","大阪維新の会","現","https://m.facebook.com/the.uedas "]
[null,"上田　ともたか"]
[2,"のぐち　ただまさ","立憲民主党","新","http://noguchi.cdp-osaka.jp "]
[null,"野口　忠真"]
[3,"やまもと　ちょうすけ","自由民主党","現","https://ja-jp.facebook.com/cyosuke.yamamoto/ "]
[null,"山本　長助"]
[4," 　 いのうえ　　　　　　","日本共産党","現"," "]
[null,"井上　ひろし"]
[5," 　 　　　　　　","大阪維新の会","現"," "]
[null,"いとう　あみ"]
[6," 　 　　　　こういちろう","公明党","現","https://komei.news/nakata/ "]
[null,"なかた　光一郎"]
[7," 　 　　　　りょう","大阪維新の会","新","https://www.kubotaryo-ishin.com/ "]
[null,"くぼた　亮"]
[8," 　 　　　　　　　　","無所属","新","http://www.planetjapan.biz/ "]
[null,"ふじた　ゆういち"]
[]
["注）候補者氏名欄には、通称を使用する場合は通称を記載。"]

{"sheet":"東住吉区","index":21,"n_rows":18,"n_cols":5,"rows_kept":18,"cut":false,"hidden":false,"merged":[[8,0,9,0],[8,2,9,2],[8,3,9,3],[8,4,9,4],[6,0,7,0],[6,2,7,2],[6,3,7,3],[6,4,7,4],[14,0,15,0],[14,2,15,2],[14,3,15,3],[14,4,15,4],[12,0,13,0],[12,2,13,2],[12,3,13,3],[12,4,13,4],[10,0,11,0],[10,2,11,2],[10,3,11,3],[10,4,11,4],[1,0,1,2],[4,0,5,0],[4,2,5,2],[4,3,5,3],[4,4,5,4]]}
[]
["大阪市東住吉区",null,null,"選挙区",{"$f":"\"　　定数　\"&VLOOKUP(東住吉区!A2,'[43]選挙区・定数（削除禁止）'!B2:C24,2,FALSE)","v":"　　定数　4"}]
[]
[]
["届出\n番号","ふりがな","党派","現元新の別","一のウェブサイト等のアドレス"]
[null,"候補者氏名"]
[1,"たなべ　のぶひろ","大阪維新の会","現","https://www.nobuhiro-tanabe.com "]
[null,"田辺　信広"]
[2," 　 たかみ　　　　　　","大阪維新の会","現","http://takamiryo.com/ "]
[null,"高見　りょう"]
[3,"　　　　　　ひろみ","自由民主党","新","http://fuchikami-hiromi.com "]
[null,"ふちかみ　浩美"]
[4,"やまもと　　　　","日本共産党","新","https://twitter.com/yamamoto7noriko "]
[null,"山本　のりこ"]
[5," 　 つじ　　　　　　　　","公明党","現","http://www.tsujiyoshitaka.com "]
[null,"辻󠄀　よしたか"]
[]
["注）候補者氏名欄には、通称を使用する場合は通称を記載。"]

{"sheet":"平野区","index":22,"n_rows":22,"n_cols":5,"rows_kept":22,"cut":false,"hidden":false,"merged":[[14,0,15,0],[14,2,15,2],[14,3,15,3],[14,4,15,4],[6,0,7,0],[6,2,7,2],[6,3,7,3],[6,4,7,4],[8,0,9,0],[8,2,9,2],[8,3,9,3],[8,4,9,4],[10,0,11,0],[10,2,11,2],[10,3,11,3],[10,4,11,4],[18,0,19,0],[18,2,19,2],[18,3,19,3],[18,4,19,4],[16,0,17,0],[16,2,17,2],[16,3,17,3],[16,4,17,4],[12,0,13,0],[12,2,13,2],[12,3,13,3],[12,4,13,4],[1,0,1,2],[4,0,5,0],[4,2,5,2],[4,3,5,3],[4,4,5,4]]}
[]
["大阪市平野区",null,null,"選挙区",{"$f":"\"　　定数　\"&VLOOKUP(平野区!A2,'[45]選挙区・定数（削除禁止）'!B2:C24,2,FALSE)","v":"　　定数　6"}]
[]
[]
["届出\n番号","ふりがな","党派","現元新の別","一のウェブサイト等のアドレス"]
[null,"候補者氏名"]
[1," 　 　　　　のりこ","公明党","現","https://www.nagatanoriko.com "]
[null,"ながた　典子"]
[2," 　 ながい　　　　　　　　","公明党","現","https://sites.google.com/view/nagaihiroyuki-sns "]
[null,"永井　ひろゆき"]
[3," 　 まつだ　　　　　　　","大阪維新の会","新","https://go2senkyo.com/seijika/170104/posts "]
[null,"松田　まさとし"]
[4," 　 たなか　　　　　　　","自由民主党","現"," "]
[null,"田中　ひろき"]
[5,"すぎむら　こうたろう","大阪維新の会","現","http://www.sugimurakotaro.com "]
[null,"杉村　幸太郎"]
[6,"おがわ　ようた","日本共産党","元","https://twitter.com/ogawayota "]
[null,"小川　陽太"]
[7," 　 よしみ　　　　　　","大阪維新の会","現","https://yoshimimisako.com "]
[null,"吉見　みさこ"]
[]
["注）候補者氏名欄には、通称を使用する場合は通称を記載。"]

{"sheet":"西成区","index":23,"n_rows":20,"n_cols":5,"rows_kept":20,"cut":false,"hidden":false,"merged":[[1,0,1,2],[4,0,5,0],[4,2,5,2],[4,3,5,3],[4,4,5,4],[16,0,17,0],[16,2,17,2],[16,3,17,3],[16,4,17,4],[10,0,11,0],[14,0,15,0],[14,2,15,2],[14,3,15,3],[14,4,15,4],[6,0,7,0],[6,2,7,2],[6,3,7,3],[6,4,7,4],[12,0,13,0],[12,2,13,2],[12,3,13,3],[12,4,13,4],[10,2,11,2],[10,3,11,3],[10,4,11,4],[8,0,9,0],[8,2,9,2],[8,3,9,3],[8,4,9,4]]}
[]
["大阪市西成区",null,null,"選挙区",{"$f":"\"　　定数　\"&VLOOKUP(西成区!A2,'[47]選挙区・定数（削除禁止）'!B2:C25,2,FALSE)","v":"　　定数　3"}]
[]
[]
["届出\n番号","ふりがな","党派","現元新の別","一のウェブサイト等のアドレス"]
[null,"候補者氏名"]
[1," 　 ふじおか　　　　　　　","大阪維新の会","現","https://www.hirokazu-fujioka.com/"]
[null,"藤岡　ひろかず"]
[2," 　 やまぐち　　　　　　","公明党","現"]
[null,"山口　ごろう"]
[3," 　 つじ　じゅんこ　","大阪維新の会","現","https://twitter.com/tsujijunko"]
[null,"辻󠄀　淳子"]
[4," 　 はなおか　　　　　","自由民主党","現","https://www.hanaokamiya.com/ "]
[null,"花岡　みや"]
[5," 　 やすだ　　　　　　","日本共産党","新"]
[null,"安田　あすか"]
[6," 　 　　　　　　　　","無所属","新","https://www.kamagourou.com "]
[null,"いながき　ひろし"]
[]
["注）候補者氏名欄には、通称を使用する場合は通称を記載。"]