�L����ID,�^�C�g��,�T�u�^�C�g��,���{����1_�J�n��,���{����1_�I����,���{����1_�J�n����,���{����1_�I������,���{����2_�J�n��,���{����2_�I����,���{����2_�J�n����,���{����2_�I������,���{����3_�J�n��,���{����3_�I����,���{����3_�J�n����,���{����3_�I����,���{����4 _�J�n��,���{����4_�I����,���{����4_�J�n����,���{����4_�I������,���{����5_�J�n��,���{����5_�I����,���{����6_�J�n����,���{����6_�I������,���{���Ԕ��l,�ꏊ����,�ꏊ�Z��,�ꏊ���l,�Ώێґ���_�ݏZ,�Ώێґ���_�݋�,�Ώێґ���_�݊w,�ΏێҔ��l,�����,������l,��t���@_�撅��,��t���@_���I,��t����_�J�n��,��t����_�I����,��t����_�J�n����,��t����_�I������,��t����_���ؕ��@,��t���l,�\�����@_�s�v,�\�����@_�v�\��,�\�����@_�d�b,�\�����@_�t�@�b�N�X,�\�����@_���[��,�\�����@_����,�\�����@_URL,�\�����@_�n�K�L,�\�����@_�����n�K�L,�\�����l,��p�x��_�s�v,��p���z�i�~�j,��p���l,�⍇���於��,�⍇����Z��,�⍇�����@_�d�b,�⍇�����@_�t�@�b�N�X,�⍇�����@_���[��,�⍇�����@_URL,�⍇�����l,���[�h��,���e,���eURL,�o�^��,�X�V��,�����̃R�[�h,�����̖���
1,�������҈�Ð��x�̑Ώۂ̕�,�y�������҈�Ô�ی��ҏ؁z,,,,,,,,,,,,,,,,,,,,,,,,,75�Έȏ�̕��i���̏Ⴊ��������ƔF�肳�ꂽ����65�Έȏ�j,,,,,,,,,,,,,,,,,,,,,,,,,,,�����T�[�r�X�ہi�ی��N���E�ی��j,,6576-9956,6576-9991,,,,,�������҈�Ð��x�̐V������ی��ҏ؁i���ΐF�j�ƁA�ی�������ʒm���𑗕t���܂��B���݂̔�ی��ҏ؁i��F�j��8������g�p�ł��Ȃ��Ȃ�܂��B7�����ɓ͂��Ȃ��ꍇ�́A���₢���킹���������B,,,,,
2,�������N�ی�����󋋎ҏ؂��X�V���܂�,,,,,,,,,,,,,,,,,,,,,,,,,,���s�������N�ی��ɉ�����70�΂���74�΂̕�,,,,,,,,,,,,,,,,,,,,,,,,,,,�����T�[�r�X�ہi�ی��N���E�ی��j,,6576-9956,6576-9991,,,,,���s�������N�ی��ɉ�����70�΂���74�΂̕��ɁA�V��������󋋎ҏ؂𑗕t���܂��B���݂̎󋋎ҏ؂�8������g�p�ł��Ȃ��Ȃ�܂��B7�����ɓ͂��Ȃ��ꍇ�́A���₢���킹���������B,,,,,
3,���ی�������ʒm���y�щ��ی����S�����؂̑��t�ɂ���,�y���ی�������ʒm���z,,,,,,,,,,,,,,,,,,,,,,,,,,,,,,,,,,,,,,,,,,,,,,,,,,,,�ی������ہi���ی��j,,6576-9859,6572-9514,,,,,65�Έȏ�̕��ŁA�N������ی�����[�t����Ă�����ցA���ی�������ʒm����7�����{�ɑ��t���܂��B�����U�ւ�[�t�����Ŕ[�t����Ă�����ɂ�4���ɑ��t���܂������A�ی����i�K�̕ύX��[�t���@���N������̂��x�����ɕύX�ƂȂ���ɂ͉��߂đ��t�������܂��B,,,,,
3,���ی�������ʒm���y�щ��ی����S�����؂̑��t�ɂ���,�y���ی����S�����؁z,,,,,,,,,,,,,,,,,,,,,,,,,,,,,,,,,,,,,,,,,,,,,,,,,,,,�ی������ہi���ی��j,,6576-9859,6572-9514,,,,,�v���E�v�x���F����󂯂Ă�����y�ё������Ƃ̎��ƑΏێ҂̕��S���ɁA8������ߘa3�N7���܂ł̊��Ԃŉ��T�[�r�X���𗘗p�����Ƃ��̎��ȕ��S�������L�ڂ����u���ی����S�����؁v��7�����{�ɑ��t���܂��B���T�[�r�X���𗘗p����ۂɁA�u���ی���ی��ҏ؁v�ƕ����Ē񎦂����肢���܂��B,,,,,
4,�V�l��Ái�ꕔ���S�������z���ꕔ�����j��Ï؂��X�V���܂�,,,,,,,,,,,,,,,,,,,,,,,,,,,,,,,,,,,,,,,,,,,,,,,,,,,,,�ی������ہi�����j,,6576-9857,6572-9514,,,,,�V�l��Ái�ꕔ���S�������z���ꕔ�����j��Ï؁i�F�j���������̕��ɁA�V������Ï؁i���F�j�𑗕t���܂��B���݂̈�Ï؂�8������g�p�ł��Ȃ��Ȃ�܂��B7�����ɓ͂��Ȃ��ꍇ�́A���₢���킹���������B,,,,,
5,�u�����蓖�����́v�̒�o�͂��ς݂ł����H,,,,,,,,,,,,,,,,,,,,,,,,,,,,,,,,,,,,,,,,,,,,,,,,,,,,,�ی������ہi�����E�q��Ďx���j,,6576-9857,6572-9514,,,,,�Ώێ҂ɂ�6�����{�Ɂu�����蓖�����́v�𑗕t���Ă��܂��B�܂���o����Ă��Ȃ����́A���}�ɉ��L�֒�o���Ă��������B��o����Ȃ��ꍇ�́A�ߘa2�N6�����i�ߘa2�N10���x�������j�ȍ~�A�蓖�̎x������~����܂��B�܂��A���̂܂�2�N���o�߂���ƁA�󋋌����Ȃ��Ȃ�܂��̂ŁA�����ӂ��������B,,,,,
6,�Љ�𖾂邭����^���`7���͋������ԁ`,,,,,,,,,,,,,,,,,,,,,,,,,,,,,,,,,,,,,,,,,,,,,,,,,,,,,�����܂��Â��萄�i�ہi���S�E���S�j�@,,6576-9787,6572-9512,,,,,�u�Љ�𖾂邭����^���v�Ƃ́A�S�Ă̍������u�ƍ߂��s�̖h�~�ƁA�߂�Ƃ����l�����̍X���v�ɂ��ė�����[�߁A���ꂼ��̗��ꂩ��͂����킹�A�ƍ߂��s�̂Ȃ����邢�Љ��z�����Ƃ����S���I�ȉ^���ŁA7���͂��̋������ԂƂȂ��Ă��܂��B,,,,,
7,�搭��c���J�Â��܂�,,7��29��,7��29��,19:00,20:00,,,,,,,,,,,,,,,,,,��߃z�[���u��߁v���Ȃ���`�斯�Z���^�[ 1�K�z�[��,,,,,,,,,,,,,,,,,,,,,,,,,,,,,,�����ہi�ɂ��킢�n�o�E�Y�ƐU���j,,6576-9885,6572-9511,,,,����́A����͊J�Â����A�S�̉�̂݊J�Â��܂��B���T���������̓}�X�N�̒��p�����肢���܂�,�ߘa���N�x�̎{��E���Ƃ̕]�����ɂ���,,,,,
8,�y��������Ă��������H�ׂ悤�I�ċx�݁u���₱�N�b�L���O�v�Q���ҕ�W�I,,8��12��,8��12��,10:00,13:00,,,,,,,,,,,,,,,,,,�����2�K�@�W�c���f���E�h�{��,,,����ݏZ�̏��w���Ƃ��̕ی��,,,,6�g,����ɒB������A��t�I��,�͂�,,7��6��,,,,�@,,,�͂�,�͂�,,,�͂�,,,,�����@�G�v�����A�O�p�ЁA�}�X�N,,400,�ޗ���,�ی������ہi�ی��q���j,,6576-9882,6572-9514,,,���Á@�`��H�������P���i�����c��i���h��j,�ċx�݂̈���A�e�q�ŗ������y���݂Ȃ���A�H���H�ו��ɂ��Ĉꏏ�ɍl���Ă݂܂��񂩁H�����́A�H���ő΍�E�����Ǘ\�h�΍���l���������K���s���܂��̂ł����͂��肢���܂��B,�y���K���j���[�i�\��j�z�E���邭��̂芪���E��������ƂЂ������u��ρE�����Ƃ킩�߂̖��X�`�E�G�߂̉ʕ�,,,,,
9,���B���C�ɂȂ�ی�҂̂��߂́u�s�A�E�J�E���Z�����O�v,,7��21��,7��21��,9:45,10:45,7��21��,7��21��,9:45,10:45,,,,,,,,,,,,,9��15���A10��20���A11��17���A1��19���i��3�Ηj���j,�����3�K,,,,,,,,,�͂�,,,,,,,,,�͂�,�͂�,,,,,,,,�͂�,,,�ی������ہi�q��Ďx�����j,,6576-9844,6572-9514,,,,,�q�ǂ��̐����┭�B�ɕs�����������̕ی�҂�ΏۂɁA���B�Ⴊ�����̎q��Ă��x������NPO�@�l�u�`���C���Y�v��\ ���V�䂩�肳��ɂ�鑊�k����񋟂��s���Ă��܂��B,,,,,
10,�m�㏕���J�[�h�̗��p�\�����󂯕t���Ă��܂�,,,,,,,,,,,,,,,,,,,,,,,,,,,,,,,,,,,,,,,,,,,,,,,,,,,,,�����܂��Â��萄�i�ہi����E�l���[���j,,6576-9975,6572-9512,,,,,�m�㏕�����Ƃ̏����������x�z���ύX�ƂȂ�܂����B�܂��A�V�^�R���i�E�C���X�����ǂɂ�鏊�������ɑΉ��������[�u�Ƃ��āA�A�w�����F����󂯂Ă�������i�\��̕��܂ށj�ɂ��ẮA�����������x�z�ȏ�ł������̑ΏۂƂȂ�܂����B�m�㏕�����Ƃ̑ΏۂƂȂ钆�w���ɂ́A6����{�ɗߘa2�N�x�㔼�i10���ȍ~�j�Ɏg����J�[�h�̐\�����ނ�X�����Ă��܂��B���p�������́A�\�����ނ�7��15���i���j�K���ŉ^�c�����ǂ֑��t���Ă��������B,,,,,
11,�����邩��Baby�I�v���}�}�u��,,7��16��,7��16��,13:15,,7��26��,7��26��,10:00,,,,,,,,,,,,,,�����8��20���i�؁j�J�×\��ł�,�����2�K�@�W�c���f��,,,�D�w�ƃp�[�g�i�[,,,,,,,,,,,,,,,�͂�,�͂�,,,,,,,,�͂�,,,�ی������ہi�n��ی������j,,6576-9968,6572-9514,,,,�}�^�j�e�B���̐�����q��Ă̏����ȂǁA�y�����w��ł݂܂��񂩁H,"�@�E�D�P���̐H�����ɂ��āE��y�}�}�ɕ������I�҂�҂���ǁi2�`3�J�����ƃ}�}�����̏W�܂�j�Ƃ̌𗬉�@���D�w���Ȍ��f�����{�B�ڍׂ͉��L�ւ��₢���킹���������B�A�E�Ԃ�����m�낤�E�������A�I���c�����A�����Ƀ`�������W�E�v���p�p�ɒm���Ăق����I�D�w�^���̌�
",,,,,
12,�����H�u�K��@���������Ԃ���񋳎�,,7��1��,7��1��,13:30,15:00,,,,,,,,,,,,,,,,,�����8��7���i���j�J�×\��ł�,�����2�K�@�W�c���f��,,,����5�`7�����̐Ԃ����ƕی��,,,,,,,,,,,,,,�͂�,,,,,,,,,,�͂�,,,�ی������ہi�ی��q���j,,6576-9882,6572-9514,,,,,�����H�u�K��,,,,,
13,�H�ƌ��N�ɂ��Ċw�ڂ��I�u���N�u���ی��h�{�R�[�X�v��u����W,�y��1��z,9��1��,9��1��,13:30,16:00,,,,,,,,,,,,,,,,,,�����2�K�@�W�c���f��,,,,,,,12��,����ɒB�������t�I��,�͂�,,7��6��,8��21��,,,,,,�͂�,�͂�,,,�͂�,,,,6��ȏ�o�Ȃ̕��ɂ͏C���؂����n���܂�,�͂�,,,�ی������ہi�ی��q���j,,6576-9882,6572-9514,,,,���^�{���C�ɂȂ�A�o�����X�悢�H���Ƃ́H�ȂǁA���N�ɉ߂������߂̐H�����ɂ��Ċw�ԁA�S9��̍u���ł��B�����g�͂������A����̕��̌��N�Â���ɂ����𗧂Ă��������B�C�����ꂽ���́A�H�������P���i���Ƃ��Ċ���ł��܂��B,�J�u���A���s�̌��N�Â�����������ł����A�u�h�{�v���ĂȂɁH,,,,,
13,�H�ƌ��N�ɂ��Ċw�ڂ��I�u���N�u���ی��h�{�R�[�X�v��u����W,�y��2��z,9��8��,9��1��,13:30,16:00,,,,,,,,,,,,,,,,,,�����2�K�@�W�c���f��,,,,,,,12��,����ɒB�������t�I��,�͂�,,7��6��,8��21��,,,,,,�͂�,�͂�,,,�͂�,,,,6��ȏ�o�Ȃ̕��ɂ͏C���؂����n���܂�,�͂�,,,�ی������ہi�ی��q���j,,6576-9882,6572-9514,,,,���^�{���C�ɂȂ�A�o�����X�悢�H���Ƃ́H�ȂǁA���N�ɉ߂������߂̐H�����ɂ��Ċw�ԁA�S9��̍u���ł��B�����g�͂������A����̕��̌��N�Â���ɂ����𗧂Ă��������B�C�����ꂽ���́A�H�������P���i���Ƃ��Ċ���ł��܂��B,�H���̃o�����X�́u�H���o�����X�K�C�h�v��,,,,,
13,�H�ƌ��N�ɂ��Ċw�ڂ��I�u���N�u���ی��h�{�R�[�X�v��u����W,�y��3��z,9��15��,9��1��,13:30,16:00,,,,,,,,,,,,,,,,,,�����2�K�@�W�c���f��,,,,,,,12��,����ɒB�������t�I��,�͂�,,7��6��,8��21��,,,,,,�͂�,�͂�,,,�͂�,,,,6��ȏ�o�Ȃ̕��ɂ͏C���؂����n���܂�,�͂�,,,�ی������ہi�ی��q���j,,6576-9882,6572-9514,,,,���^�{���C�ɂȂ�A�o�����X�悢�H���Ƃ́H�ȂǁA���N�ɉ߂������߂̐H�����ɂ��Ċw�ԁA�S9��̍u���ł��B�����g�͂������A����̕��̌��N�Â���ɂ����𗧂Ă��������B�C�����ꂽ���́A�H�������P���i���Ƃ��Ċ���ł��܂��B,�ȒP�I�����̍����A�����K���a�ƐH�����@�u�a�C�̎n�܂�͔얞����v,,,,,
13,�H�ƌ��N�ɂ��Ċw�ڂ��I�u���N�u���ی��h�{�R�[�X�v��u����W,�y��4��z,9��29��,9��1��,13:30,16:00,,,,,,,,,,,,,,,,,,�����2�K�@�W�c���f��,,,,,,,12��,����ɒB�������t�I��,�͂�,,7��6��,8��21��,,,,,,�͂�,�͂�,,,�͂�,,,,6��ȏ�o�Ȃ̕��ɂ͏C���؂����n���܂�,�͂�,,,�ی������ہi�ی��q���j,,6576-9882,6572-9514,,,,���^�{���C�ɂȂ�A�o�����X�悢�H���Ƃ́H�ȂǁA���N�ɉ߂������߂̐H�����ɂ��Ċw�ԁA�S9��̍u���ł��B�����g�͂������A����̕��̌��N�Â���ɂ����𗧂Ă��������B�C�����ꂽ���́A�H�������P���i���Ƃ��Ċ���ł��܂��B,���N�������̂΂����߂̐����K���Ƃ́H�A�m���Ėh�����I�ƒ�Ŗ𗧂H���ł̒m���Ɨ\�h�@�A���Ȃ��̐H����f�f���܂�,,,,,
13,�H�ƌ��N�ɂ��Ċw�ڂ��I�u���N�u���ی��h�{�R�[�X�v��u����W,�y��5��z,10��6��,9��1��,13:30,16:00,,,,,,,,,,,,,,,,,,�����2�K�@�W�c���f��,,,,,,,12��,����ɒB�������t�I��,�͂�,,7��6��,8��21��,,,,,,�͂�,�͂�,,,�͂�,,,,6��ȏ�o�Ȃ̕��ɂ͏C���؂����n���܂�,�͂�,,,�ی������ہi�ی��q���j,,6576-9882,6572-9514,,,,���^�{���C�ɂȂ�A�o�����X�悢�H���Ƃ́H�ȂǁA���N�ɉ߂������߂̐H�����ɂ��Ċw�ԁA�S9��̍u���ł��B�����g�͂������A����̕��̌��N�Â���ɂ����𗧂Ă��������B�C�����ꂽ���́A�H�������P���i���Ƃ��Ċ���ł��܂��B,�����x�i���o�[1�^�����K�u�I��������Ƒ̂��y���Ȃ�?!�v,,,,,
13,�H�ƌ��N�ɂ��Ċw�ڂ��I�u���N�u���ی��h�{�R�[�X�v��u����W,�y��6��z,10��13��,9��1��,13:30,16:00,,,,,,,,,,,,,,,,,,�����2�K�@�W�c���f��,,,,,,,12��,����ɒB�������t�I��,�͂�,,7��6��,8��21��,,,,,,�͂�,�͂�,,,�͂�,,,,6��ȏ�o�Ȃ̕��ɂ͏C���؂����n���܂�,�͂�,,,�ی������ہi�ی��q���j,,6576-9882,6572-9514,,,,���^�{���C�ɂȂ�A�o�����X�悢�H���Ƃ́H�ȂǁA���N�ɉ߂������߂̐H�����ɂ��Ċw�ԁA�S9��̍u���ł��B�����g�͂������A����̕��̌��N�Â���ɂ����𗧂Ă��������B�C�����ꂽ���́A�H�������P���i���Ƃ��Ċ���ł��܂��B,����I�h�{���v�Z�A�����K���a�ƐH�����A�������K�u���̐H�ׂ�ʂ͂��ꂮ�炢�H�v,,,,,
13,�H�ƌ��N�ɂ��Ċw�ڂ��I�u���N�u���ی��h�{�R�[�X�v��u����W,�y��7��z,10��27��,9��1��,13:30,16:00,,,,,,,,,,,,,,,,,,�����2�K�@�W�c���f��,,,,,,,12��,����ɒB�������t�I��,�͂�,,7��6��,8��21��,,,,,,�͂�,�͂�,,,�͂�,,,,6��ȏ�o�Ȃ̕��ɂ͏C���؂����n���܂�,�͂�,,,�ی������ہi�ی��q���j,,6576-9882,6572-9514,,,,���^�{���C�ɂȂ�A�o�����X�悢�H���Ƃ́H�ȂǁA���N�ɉ߂������߂̐H�����ɂ��Ċw�ԁA�S9��̍u���ł��B�����g�͂������A����̕��̌��N�Â���ɂ����𗧂Ă��������B�C�����ꂽ���́A�H�������P���i���Ƃ��Ċ���ł��܂��B,�����K���a�ƐH�����B�u�������E���A�a�E�����ُ�ǁv,,,,,
13,�H�ƌ��N�ɂ��Ċw�ڂ��I�u���N�u���ی��h�{�R�[�X�v��u����W,�y��8��z,11��10��,9��1��,13:30,16:00,,,,,,,,,,,,,,,,,,�����2�K�@�W�c���f��,,,,,,,12��,����ɒB�������t�I��,�͂�,,7��6��,8��21��,,,,,,�͂�,�͂�,,,�͂�,,,,6��ȏ�o�Ȃ̕��ɂ͏C���؂����n���܂�,�͂�,,,�ی������ہi�ی��q���j,,6576-9882,6572-9514,,,,���^�{���C�ɂȂ�A�o�����X�悢�H���Ƃ́H�ȂǁA���N�ɉ߂������߂̐H�����ɂ��Ċw�ԁA�S9��̍u���ł��B�����g�͂������A����̕��̌��N�Â���ɂ����𗧂Ă��������B�C�����ꂽ���́A�H�������P���i���Ƃ��Ċ���ł��܂��B,���s�̐H��`�Ԃ���񂩂炨�N���܂Ł`�A�u�H�i�\���v�`�F�b�N���Ă܂����H�R�c�R�c���߂č��̋����I���e���傤�Ǘ\�h�ƐH����,,,,,
13,�H�ƌ��N�ɂ��Ċw�ڂ��I�u���N�u���ی��h�{�R�[�X�v��u����W,�y��9��z,11��24��,9��1��,13:30,16:00,,,,,,,,,,,,,,,,,,�����2�K�@�W�c���f��,,,,,,,12��,����ɒB�������t�I��,�͂�,,7��6��,8��21��,,,,,,�͂�,�͂�,,,�͂�,,,,6��ȏ�o�Ȃ̕��ɂ͏C���؂����n���܂�,�͂�,,,�ی������ہi�ی��q���j,,6576-9882,6572-9514,,,,���^�{���C�ɂȂ�A�o�����X�悢�H���Ƃ́H�ȂǁA���N�ɉ߂������߂̐H�����ɂ��Ċw�ԁA�S9��̍u���ł��B�����g�͂������A����̕��̌��N�Â���ɂ����𗧂Ă��������B�C�����ꂽ���́A�H�������P���i���Ƃ��Ċ���ł��܂��B,���{�̌��N�A�H�̌���́H�A�ЊQ�ɔ�����H�A���܂ł̂����炢�A�n�߂Ă݂܂��񂩐H��̃{�����e�B�A�I�A�u��,,,,,
14,�m�㏕�����ƎQ�掖�Ǝ҂֍L�񋦗͂��s���܂�,,,,,,,,,,,,,,,,,,,,,,,,,,,,,,,,,,,,,,,,,,,,,,,,,,,,,�����܂��Â��萄�i�ہi����E�l���[���j,,6576-9975,6572-9512,,,,,���w����ΏۂƂ����m�㏕�����ƂɎQ�悷����̏����𖞂������Ǝ҂֎�u����W���ɂ�����L��ɋ��͂��Ă��܂��B�L�񋦗͂���]����m���Ǝ҂̕��͉��L�܂ł��⍇�����������B,,,,,
15,�����\�����s���܂�,,,,,,,,,,,,,,,,,,,,,,,,,,,,,,,,,,,,,,,,,,,,,,,,,,,,,�����ہi�ɂ��킢�n�o�E�Y�ƐU���j,,6576-9978,6572-9511,,,,,�`����̓��H��͐�A�����Ő��|�������s���Ă������ΏۂƂ��āA���N�\�����s���Ă��܂��B���E���������������܂�����A7��17���i���j�܂łɉ��L�ɂ��⍇�����������B�\���ɂ͈��̗v���𖞂����K�v������܂��B,,,,,
16,�e�팒�N�f��,�y���񌟐f�E���e���傤�ǌ��f ��1�z������i�}�����O���t�B�����j,7��26��,7��26��,9:30,10:30,9��2��,9��2��,9:30,10:30,9��12��,9��12��,9:30,10:30,,,,,,,,,,�����2�K�@�W�c���f��,,,40�Έȏ�,,,,,����ɂȂ莟��A��t���I��,�͂�,,,,,,,,,�͂�,�͂�,,,�͂�,,,,��1�@���񌟐f�́A�戵��Ë@�ւł���f�ł��܂��B�V�l��Ï؁A����󋋎ҏ؁A�������҈�Ô�ی��ҏ؂��������̕��A�����ی�E�s���Ŕ�ېŐ��тł��邱�Ƃ��킩�鏑�ނ��������̕��͔�p�������ɂȂ�܂��̂ŁA���������Q���������B�ڂ����͂��₢������������,,1500,,�ی������ہi�ی��q���j,,6576-9882,6572-9514,,,,,�y���񌟐f�E���e���傤�ǌ��f ��1�z������i�}�����O���t�B�����j,,,,,
16,�e�팒�N�f��,�y���񌟐f�E���e���傤�ǌ��f ��1�z�݂���i�ݕ��w�������j��2,8��9��,8��9��,9:30,10:30,9��12��,9��12��,9:30,10:30,,,,,,,,,,,,,,�����2�K�@�W�c���f��,,,40�Έȏ�,,,,,����ɂȂ莟��A��t���I��,�͂�,,,,,,,,,�͂�,�͂�,,,�͂�,,,,��1�@���񌟐f�́A�戵��Ë@�ւł���f�ł��܂��B�V�l��Ï؁A����󋋎ҏ؁A�������҈�Ô�ی��ҏ؂��������̕��A�����ی�E�s���Ŕ�ېŐ��тł��邱�Ƃ��킩�鏑�ނ��������̕��͔�p�������ɂȂ�܂��̂ŁA���������Q���������B�ڂ����͂��₢�������������B��2�@�݂��񌟐f�́A50�Έȏ�̕��́u�ݕ��w�������v�Ǝ戵��Ë@�ւɂ����āu�ݓ����������v�̂����ꂩ��I�����Ď�f���邱�Ƃ��ł��܂��B��N�x�A�u�ݓ����������v����f���ꂽ���́A�u�ݕ��w�������v�u�ݓ����������v�Ƃ��Ɏ�f�ł��܂���B,,500,�戵��Ë@�ւ�1500�~,�ی������ہi�ی��q���j,,6576-9882,6572-9514,,,,,�݂���i�ݕ��w�������j,,,,,
16,�e�팒�N�f��,�y���񌟐f�E���e���傤�ǌ��f ��1�z�咰����i�Ɖu�֐��������j,8��9��,8��9��,9:30,10:30,9��12��,9��12��,9:30,10:30,,,,,,,,,,,,,,�����2�K�@�W�c���f��,,,40�Έȏ�,,,,,����ɂȂ莟��A��t���I��,�͂�,,,,,,,,,�͂�,�͂�,,,�͂�,,,,��1�@���񌟐f�́A�戵��Ë@�ւł���f�ł��܂��B�V�l��Ï؁A����󋋎ҏ؁A�������҈�Ô�ی��ҏ؂��������̕��A�����ی�E�s���Ŕ�ېŐ��тł��邱�Ƃ��킩�鏑�ނ��������̕��͔�p�������ɂȂ�܂��̂ŁA���������Q���������B�ڂ����͂��₢������������,,300,,�ی������ہi�ی��q���j,,6576-9882,6572-9514,,,,,�咰����i�Ɖu�֐��������j,,,,,
16,�e�팒�N�f��,�y���񌟐f�E���e���傤�ǌ��f ��1�z�x����i�����w�������j�i�\ႌ����j,8��9��,8��9��,9:30,10:30,9��12��,9��12��,9:30,10:30,,,,,,,,,,,,,,�����2�K�@�W�c���f��,,,40�Έȏ�,,,,,����ɂȂ莟��A��t���I��,�͂�,,,,,,,,,�͂�,�͂�,,,�͂�,,,,��1�@���񌟐f�́A�戵��Ë@�ւł���f�ł��܂��B�V�l��Ï؁A����󋋎ҏ؁A�������҈�Ô�ی��ҏ؂��������̕��A�����ی�E�s���Ŕ�ېŐ��тł��邱�Ƃ��킩�鏑�ނ��������̕��͔�p�������ɂȂ�܂��̂ŁA���������Q���������B�ڂ����͂��₢������������,�͂�,,�\ႌ�����400�~,�ی������ہi�ی��q���j,,6576-9882,6572-9514,,,,,�x����i�����w�������j�i�\ႌ����j,,,,,
16,�e�팒�N�f��,�y���񌟐f�E���e���傤�ǌ��f ��1�z���e���傤�ǌ��f,7��26��,7��26��,9:30,10:30,9��2��,9��2��,9:30,10:30,9��12��,9��12��,9:30,10:30,,,,,,,,,,�����2�K�@�W�c���f��,,,�P�W�Έȏ�,,,,,����ɂȂ莟��A��t���I��,�͂�,,,,,,,,,�͂�,�͂�,,,�͂�,,,,��1�@���񌟐f�́A�戵��Ë@�ւł���f�ł��܂��B�V�l��Ï؁A����󋋎ҏ؁A�������҈�Ô�ی��ҏ؂��������̕��A�����ی�E�s���Ŕ�ېŐ��тł��邱�Ƃ��킩�鏑�ނ��������̕��͔�p�������ɂȂ�܂��̂ŁA���������Q���������B�ڂ����͂��₢������������,�͂�,,,�ی������ہi�ی��q���j,,6576-9882,6572-9514,,,,,���e���傤�ǌ��f,,,,,
16,�e�팒�N�f��,�y���j���f�z�@,7��6��,7��6��,10:00,11:00,8��3��,8��3��,10:00,11:00,,,,,,,,,,,,,,�����2�K�@�W�c���f��,,,�P�T�Έȏ�,,,,,,,,,,,,,,�͂�,,,,,,,,,,�͂�,,,�ی������ہi�ی��q���j,,6576-9882,6572-9514,,,,,���j���f,,,,,
16,�e�팒�N�f��,�y���Ȍ��N���k�z,7��7��,7��7��,9:30,10:30,7��9��,7��9��,9:30,10:30,9��2��,9��2��,9:30,10:30,,,,,,,,,,,,,,,,,,,,,,,,,,,,,,,,,,,,,,,,�ی������ہi�ی��q���j,,6576-9882,6572-9514,,,,,���Ȍ��N���k,,,,,
16,�e�팒�N�f��,�y���茒�N�f���z��3,7��7��,7��7��,9:30,11:00,,,,,,,,,,,,,,,,,,,,,,,,,,,,,,,,,,,,,,,,,,,,��3�@���茒�f�́A�戵��Ë@�ւł���f�ł��܂��i���̏ꍇ�͗\��K�v�j,,,,�ی������ہi�ی��q���j,,6576-9882,6572-9514,,,,,���茒�N�f��,,,,,
17,�ٌ�m�ɂ��@�����k,,7��7��,7��7��,13:00,17:00,7��14��,7��14��,13:00,17:00,7��21��,7��21��,13:00,17:00,7��28��,7��28��,13:00,17:00,,,,,��1�E2�E3�E4�Ηj��,�����1�K�@���k��,,,,,,,8��,,�͂�,,����,,9:00,,,,,�͂�,�͂�,,,,,,,�����k�������̓}�X�N�̒��p�����肢���܂��B���M�E�P�E�����ɓ��̏Ǐ�̂�����͂��\�񂢂������܂���B,�͂�,,,�����ہi�ɂ��킢�n�o�E�Y�ƐU���j,,6576-9978,6572-9511,,,,,�ٌ�m�ɂ��@�����k,,,,,
18,�s�����k,,7��2��,7��2��,14:00,16:00,,,,,,,,,,,,,,,,,��1�ؗj��,�����1�K�@���k��,,,,,,,,,�͂�,,,7��2��,,15:00,,,�͂�,,,,,,,,,,�͂�,,,�����ہi�ɂ��킢�n�o�E�Y�ƐU���j,,6576-9978,6572-9511,,,,,�s�����k,,,,,
19,�s���Y���k,,7��16��,7��16��,13:00,16:00,,,,,,,,,,,,,,,,,��3�ؗj��,�����1�K�@���k��,,,,,,,8��,,�͂�,,7��6��,,9:00,,,,,�͂�,�͂�,,,,,,,,�͂�,,,�����ہi�ɂ��킢�n�o�E�Y�ƐU���j,,6576-9978,6572-9511,,,,,�s���Y���k,,,,,
20,���_�Ȉ�ɂ�鑊�k,,7��9��,7��9��,14:00,,,,,,,,,,,,,,,,,,,�����3�K�@���k��,,,,,,,,,�͂�,,,,,,,,,�͂�,�͂�,,,,,,,,�͂�,,,�ی������ہi�n��ی������j,,6576-9968,6572-9514,,,,,���_�Ȉ�ɂ�鑊�k,,,,,
