�L����ID,�^�C�g��,�T�u�^�C�g��,���{����1_�J�n��,���{����1_�I����,���{����1_�J�n����,���{����1_�I������,���{����2_�J�n��,���{����2_�I����,���{����2_�J�n����,���{����2_�I������,���{����3_�J�n��,���{����3_�I����,���{����3_�J�n����,���{����3_�I����,���{����4 _�J�n��,���{����4_�I����,���{����4_�J�n����,���{����4_�I������,���{����5_�J�n��,���{����5_�I����,���{����6_�J�n����,���{����6_�I������,���{���Ԕ��l,�ꏊ����,�ꏊ�Z��,�ꏊ���l,�Ώێґ���_�ݏZ,�Ώێґ���_�݋�,�Ώێґ���_�݊w,�ΏێҔ��l,�����,������l,��t���@_�撅��,��t���@_���I,��t����_�J�n��,��t����_�I����,��t����_�J�n����,��t����_�I������,��t����_���ؕ��@,��t���l,�\�����@_�s�v,�\�����@_�v�\��,�\�����@_�d�b,�\�����@_�t�@�b�N�X,�\�����@_���[��,�\�����@_����,�\�����@_URL,�\�����@_�n�K�L,�\�����@_�����n�K�L,�\�����l,��p�x��_�s�v,��p���z�i�~�j,��p���l,�⍇���於��,�⍇����Z��,�⍇�����@_�d�b,�⍇�����@_�t�@�b�N�X,�⍇�����@_���[��,�⍇�����@_URL,�⍇�����l,���[�h��,���e,���eURL,�o�^��,�X�V��,�����̃R�[�h,�����̖���
1,���m�点,�ߘa3�N�x��2��`��搭��c���J�Â��܂�,11��24���i���j,,18��30��,19��30��,,,,,,,,,,,,,,,,,,�`������@5�K�@��c��,,,,,,,,,,,11��11���i�؁j,11��17���i���j,,,,,,,,,,,,,,,,,,�����ہi�ɂ��킢�n�o�E�Y�ƐU���j,,6576-9683,6572-9511,,,,,�c��@�ߘa3�N�x�̎{��E���Ƃ̒��ԕ]���ɂ��ā@���T����������18�������t�i�撅���j���T���������́A�}�X�N�̒��p�����肢���܂����J�Õ��@�̕ύX���͒��~����ꍇ������܂��̂ŁA�ڍׂ͍`��z�[���y�[�W�ł��m�F���������B,,,,,
2,,���O�d�b�̔p�~�ɂ���,,,,,,,,,,,,,,,,,,,,,,,,,,,,,,,,,,,,,,,,,,,,,,,,,,,,�����ہi�����E�l�ވ琬�j,,6576-9937,6572-9511,,,,,�����{�d�M�d�b������Ђ�藘�p�̏��Ȃ����O�d�b�̔p�~�ɂ��Ēʒm������A�`�����1�K���փz�[���ɐݒu���Ă�����O�d�b���ߘa3�N12�����{�ɓP������邱�ƂɂȂ�܂����B���s�ւ����������܂����A�������Ƃ����͂̂قǂ�낵�����肢�������܂��B�Ȃ��A�P�������m�肵�܂�����A�ʓr�A�L�񎆁i12�����j�y�уz�[���y�[�W�Ŏ��m���܂��B,,,,,
3,,�w�Z�I�𐧊�]�Z�̕ύX��t�ɂ���,,,,,,,,,,,,,,,,,,,,,,,,,,,,,,,,,,,,,,,,,,,,,,,,,,,,�����T�[�r�X�ہi�Z�����j,,6576-9963,6576-9991,,,,,�w�Z�I�𐧂̊�]�Z��ύX�������ꍇ�́A��L���Ԓ��Ɍ���A�����ɂĕύX�\������t���܂��B���̊��Ԉȍ~�́A��]�Z�̕ύX��I����]�̎������͂ł��܂���B�ڂ�����11����{�ɑ��t�����]�������ʒʒm���������������B,,,,,
4,�u���E�C�x���g,�`��WORKS�T���c���J�Â��܂��I,12��4���i�y�j,,,,,,,,,,,,,,,,,,,,,,,,�`��,,,���w1�`3�N��,10��,���Q���ɂ͕ی�҂̓������K�v�ł�,,,,,,,,,,,,,,,,,,,,,,�����ہi�ɂ��킢�E�Y�ƐU���j,,6576-9885,6572-9511,,,,,�K���Ɓ@�ۑP�C���e�b�N�A���[�i���i�\��j�`����̊�Ƃ�K�₵�ē����y�����A�Z�p�̂�������m���Ċ����Ă��炤�̌��^�C�x���g�u�`��WORKS�T���c�v�I���N�́A�V�^�R���i�E�C���X�����Ǌg��h�~�̂��ߋK�͂��k�����ĊJ�×\��ł��B������@���ڍׂ͍`��z�[���y�[�W�ł��m�F���������B,,,,,
5,,�u2021�`��h�Ѓ}���V�F�|�y�����w�Ԗh�ЃC�x���g�|�v�̊J��,12��4���i�y�j,,13��30��,16��30��,,,,,,,,,,,,,,,,,,��߃z�[���u��߁v���Ȃ���`�斯�Z���^�[�@1F�z�[���y�уG���g�����X,,,,,,,,,,,,,,,,,�͂�,,,,,,,,,,,,,�����܂��Â��萄�i�ہi�s���������i�j,,6576-9884,6572-9512,,,,,����1���@13��40���`14��50���@�V���|�W�E���u�n��A�g�^�}���V�����h�Ёv�@�}���V�����Z���ƒn��Ƃ̘A�g��h�Ђ̎��_����l���܂�����2���@15���`15��30���@�u�h�ЃN�b�L���O�v�@�h�АH�̃N�b�L���O�u������H�̃A�����W���V�s���Љ�܂��I����3���@15��40���`16��10���@�u�y�b�g�Ɩh�Ёv�@�y�b�g��A��Ă̔��Ɋւ���Z�~�i�[�ł��B�����̑��A�q�ǂ����y�����h�Ђ��w�ׂ�p�l���W���₨�G�������ł����݃R�[�i�[��݂���\��ł��B�ڍׂ����܂莟��z�[���y�[�W�Ɍf�ڂ��܂��B,,,,,
6,,�Q����E�`��E���捇���u2021��37��Ȃɂ�l���W�v,,,,,,,,,,,,,,,,,,,,,,�`������@2�K�@�W�c���f��,,,,,,,,,,,,,,,,,,,,,,,,,,,,,,�����܂��Â��萄�i�ہi����E�l���[���j,,6576-9975,6572-9512,,,,,�V�^�R���i�E�C���X�����ǂ������g�債�Ă��鍡�A���Ԃ񂲂ƂƂ��čl���Ăق������񂯂�ɂ��āA�ߋ��̗��j�␳�����m������ƂƂ��ɍl���Ă݂܂��񂩁H����́u�Ȃɂ�l���W�v�͂��ł��ǂ��ł��Ȃ�ǂł��������������܂��I�i1�j���Œm�낤�I�|�f�W�^�����[�t���b�g�|�����ǂɊւ��鍷�ʂ̗��j�⓯�a���i�������ʁj�ɂ��āA�킩��₷��������܂��B���̃��[�t���b�g�͍`�������`�斯�Z���^�[�ɔz�˂��Ă��܂��I�i2�j�݂Ēm�낤�I�|�I�����C���p�l���W�|�u�R���i�Ў���̐l���v���n�߁A4�̃e�[�}�̃p�l���𒆐S�Ƀf�W�^���ł��͂����܂��B�i3�j���킵���w�ڂ��I�|�I�����C���u����|�R���i�Ђŏ�����V���O���}�U�[�ւ̐H�x����ʂ�����������[�������錻��ɂ��Ă��`�����܂��B���e�[�}�@�V���O���}�U�[�Ə����̕n���`�R���i�ЂŐ[�����������Ɓ`���u�t�@�R�����q((��܂����@���ʂ�))����iNPO�@�l�@���񂮂�܂������E�ӂ��[��ށE�֐��������j�i4�j�Ƃ��ɍl���悤�I�|�I�����C���f���\���ڂ����m�邽�߂Ɂu���āv�u�����āv�l���邱�Ƃ̂ł���f�������J���܂��B�iA�j�u�n���Z���a�̗��j�Ɖ񕜎҂̐����v�iB�j�uSDGs����l������Ǝ������̐H�����v�i2�j�i3�j�i4�j�̌��J����12��1���ł��u�Ȃɂ�l���W�v���݃T�C�g,,,,,
7,,�Ƒ�����,11��19���i������3���j���j,,14��,16��,,,,,,,,,,,,,,,,,,,,,,,,,,,,,,,,,,,,,,,,,,,,,,,,�ی������ہi�n��ی������j3�K33��,,6576-9968,6572-9512,,,,,���Ƒ������������ǂƂ����a�C�𗝉����A�ڂ������w�Ԃ��Ƃ́A���{�l�̉񕜂ɖ𗧂��܂��B���������Ă���s����Y�݂Ȃǂ��A�ꏏ�ɘb�������Ă݂܂��񂩁B���Q�����҂����Ă��܂��B���_�Ȉ�̘b�A�Ƒ����m�̌𗬂Ȃǁ��ڍׂ̃v���O�����ɂ��Ă͂��⍇�킹������,,,,,
8,�q���,�����H�u�K��@���������Ԃ���񋳎�,12��1���i���j,,13��30��,15��,,,,,,,,,,,,,,,,,,�`������@2�K�@�W�c���f��,,,,,,����5�`7�����̐Ԃ����ƕی��,,,,,,,,,,,,�͂�,,,,,,,,,�͂�,,,�ی������ہi�ی��q���j,,6576-9882,6572-9514,,,,,,,,,,
9,���N,�C���t���G���U�\�h�ڎ�̂��m�点,,�ߘa4�N1��31���i���j�܂�,,,,,,,,,,,,,,,,,,,,�ϑ���Ë@�֋y�шϑ����V�l�ی��E�����{�݁i�����҂̂݁j,,,,,,��60�Έȏ�65�Ζ����̕��ŁA�S���E�t���E�ċz��̋@�\��Ɖu�̋@�\�Ɏ��Ȃ̓��퐶�����ɓx�ɐ����������x�̏Ⴊ���i�g�̏Ⴊ���Ҏ蒠1�������j��L����s���̕���,,,,,,,,,,,,�͂�,,,,,,,,,,"1,500�~",,�ی������ہi�ی��q���j,,6576-9882,6572-9514,,,,,�����ی�󋋎҂���юs���Ŕ�ېŐ��т̕��́A�ڎ퓖���Ɋm�F�ł��鏑�ނ������Q���������Ɩ����ɂȂ�܂��������ی�󋋎ҁF�ی쌈��ʒm��������ېŐ��т̕��F���ی�������ʒm���i�ی����i�K��1�`4�i�K�Ɍ���j���ϑ���Ë@�ւ֓d�b�Ȃǂł��\���݂�������,,,,,
10,,�e�팒�N�f��,,,,,,,,,,,,,,,,,,,,,,�`�����2�K,,,,,,,,,,,,,,,,,,,,,,,,,,,,,,�ی������ہi�ی��q���j,,6576-9882,6572-9514,,,,,,,,,,
11,,���񌟐f�E���e���傤�ǌ��f,,,,,,,,,,,,,,,,,,,,,,,,,,,,,,,,,,,,,,,,,,,,,,,,,,,,�ی������ہi�ی��q���j,,6576-9882,6572-9514,,,,,�����񌟐f�́A�戵��Ë@�ւł���f�ł��܂��B����󋋎ҏ؁A�������҈�Ô�ی��ҏ؂��������̕��A�����ی�E�s���Ŕ�ېŐ��тł��邱�Ƃ��킩�鏑�ނ��������̕��͔�p�������ɂȂ�܂��̂ŁA���������Q���������B�ڂ����͂��₢���킹���������B,,,,,
12,,������i�}�����O���t�B�����j,12��14���i��),,18��30��,19��30��,�ߘa4�N1��27���i�؁j,,9��30��,10��30��,�ߘa4�N2��7���i���j,,13��30��,14��30��,,,,,,,,,,,,,,,,40�Έȏ�,,,,,,,,,,,,,,,,,,,,,,�@1500�~,,�ی������ہi�ی��q���j,,6576-9882,6572-9514,,,,,,,,,,
13,,�咰����i�Ɖu�֐��������j,�ߘa4�N2��7���i���j,,9��30��,10��30��,,,,,,,,,,,,,,,,,,,,,,,,40�Έȏ�,,,,,,,,,,,,,,,,,,,,,,300�~,,�ی������ہi�ی��q���j,,6576-9882,6572-9514,,,,,,,,,,
14,,�x����i�����w�������j�i�\ႌ����j,�ߘa4�N2��7���i���j,,9��30��,10��30��,,,,,,,,,,,,,,,,,,,,,,,,40�Έȏ�,,,,,,,,,,,,,,,,,,,,,�������\ႌ�����400�~,,,�ی������ہi�ی��q���j,,6576-9882,6572-9514,,,,,,,,,,
15,,���e���傤�ǌ��f,12��14���i�΁j,,18��30��,19��30��,�ߘa4�N1��27���i�؁j,,9��30��,10��30��,�ߘa4�N2��7���i���j,,13��30��,14��30��,,,,,,,,,,,,,,,,18�Έȏ�,,,,,,,,,,,,�͂�,,,,,,,,,,,,�ی������ہi�ی��q���j,,6576-9882,6572-9514,,,,,,,,,,
16,,���j���f�@�\��s�v,12��6���i���j,,10��,11��,�ߘa4�N1��31���i���j,,10��,11��,,,,,,,,,,,,,,,,,,,,15�Έȏ�,,,,,,,,,,,,,,,,,,,,,�͂�,,,�ی������ہi�ی��q���j,,6576-9882,6572-9514,,,,,,,,,,
17,,���Ȍ��N���k,11��2���i�΁j,,9��30��,10��30��,�ߘa4�N1��27���i�؁j,,9��30��,10��30��,,,,,,,,,,,,,,,,,,,,,,,,,,,,,,,,�͂�,,,,,,,,,,,,�ی������ہi�ی��q���j,,6576-9882,6572-9514,,,,,,,,,,
18,,���茒�N�f���@�\��s�v,�ߘa4�N2��7���i���j,,9��30��,11��,,,,,,,,,,,,,,,,,,,,,,,,�������N�ی������ҁi40�`74�΁j�@�������҈�Ð��x������,,,,,,,,,,,,,,,,,,,,,�����@����f���ƕی��؂��K�v,,,�ی������ہi�ی��q���j,,6576-9882,6572-9514,,,,,�E���f��f�ɂ�����z�����K�v�ȕ��͎��O�ɂ��A�����������B�E�݂��񌟐f�́A�ߘa3�N�x���R���i�Ђɂ�����s���ւ̈��S�E���S�Ȃ��񌟐f�̒񋟂��l�����A�`��ی������Z���^�[���ł̏W�c�ɂ��݂��񌟐f��p�~���A�戵��Ë@�ւ݂̂Ŏ��{���邱�ƂƂȂ�܂����B�E7������A���N�x50�΁E55�΁E60�΁E65�΁E70�΂ƂȂ�j���s����ΏۂƂ����O���B���񌟐f���戵��Ë@�ւŎ��{���Ă��܂��B���ڎ戵��Ë@�ւ֗\�񂵂Ď�f���Ă��������B�ڂ����͒S���܂ŁB,,,,,
19,���k,�d���␶���ɂ�����̕��ց@�ЂƂ�ŔY�܂Ȃ��ŁA�܂��͂����k��,,,,,,,,,,,,,,,,,,,,,,,,,,,,,,,,,,,,,,,,,,,,,,,,,,,,���炵�̃T�|�[�g�R�[�i�[�i�`��������@2�K�j,,6576-9897,,,,,,�u���������̂Ɏd���ɏA���Ȃ��v�u���̂܂܂ł͏Z���������������v�u�Љ�ɏo�����̂ɗE�C���o�Ȃ��v�u�����A�ƌv���Ԏ��v�ȂǁA�ǂ��ɑ��k���Ă����̂�������Ȃ��Y�݂�s���Ȃǂ̐����ۑ�ɂ��āA���k�x���������Y���A�ꏏ�ɉ����̕��@��T���܂��B,,,,,
20,,���_�Ȉ�ɂ�鑊�k,11��11���i�؁j,,,,11��25���i�؁j,,,,,,,,,,,,,,,,,�`������@3�K�@���k��,,,,,,,,,,,,,,,,,,�͂�,,,,,,,,,�͂�,,,�ی������ہi�n��ی������j,,6576-9968,6572-9514,,,,,������̕ϒ��ɋC�Â�������Ƃɑ��k���Ă݂܂��񂩁H���Ƒ���x���҂���̑Ή��̎d���̑��k���\�ł��B,,,,,
21,�`������ł̊e�푊�k,�ٌ�m�ɂ��@�����k,��1�A2�A3�Ηj���i11��2���A9���A16���j,,13��,17��,��5�Ηj���i11��30���j,,13��,17��,,,,,,,,,,,,,,�`������@1�K�@���k��,,,,,,,8���A16��,,,,,,,,,,,�͂�,�͂�,,,,,,,,�͂�,,,�����ہi�ɂ��킢�n�o�E�Y�ƐU���j,,6576-9978,6572-9511,,,,,,,,,,
22,,�s�����k,��1�ؗj���i11��4���j,,14��,16��,,,,,,,,,,,,,,,,,,�`������@1�K�@���k��,,,,,,,,,,,,,,,,,�͂�,,,,,,,,,,�͂�,,,�����ہi�ɂ��킢�n�o�E�Y�ƐU���j,,6576-9978,6572-9511,,,,,,,,,,
23,,�s���Y���k,��3�ؗj���i11��18���j,,13��,16��,,,,,,,,,,,,,,,,,,,,,,,,,8��,,,,,,,,,,,�͂�,�͂�,,,,,,,,�͂�,,,�����ہi�ɂ��킢�n�o�E�Y�ƐU���j,,6576-9978,6572-9511,,,,,,,,,,
